Reaction Details
TargetLanosterol 14-alpha demethylase
LigandBDBM25815
Substrate/CompetitorBDBM10852
Meas. Tech.Ligand Binding Assay
pH7.5±n/a
Temperature310.15±n/a K
Kd 7500±n/a nM
CommentsKd from 5 to 10 uM.
Citation Podust, LMvon Kries, JPEddine, ANKim, YYermalitskaya, LVKuehne, ROuellet, HWarrier, TAlteköster, MLee, JSRademann, JOschkinat, HKaufmann, SHWaterman, MR Small-molecule scaffolds for CYP51 inhibitors identified by high-throughput screening and defined by X-ray crystallography. Antimicrob Agents Chemother51:3915-23 (2007) 
 
Lanosterol 14-alpha demethylase
Name:Lanosterol 14-alpha demethylase
Type:Monooxygenase; oxidoreductase
Mol. Mass.:50869.67
Organism:Mycobacterium tuberculosis (strain CDC 1551 / Oshkosh)
Description:P9WPP8
Residue:451
BDBM25815
BDBM10852
NameBDBM25815
Synonyms:2-[2-ethyl-4-(4-methoxyphenyl)-2-methyloxan-4-yl]ethan-1-amine Compound 3683-0555
TypeSmall organic molecule
Emp. Form.C17H27NO2
Mol. Mass.277.4018
SMILESCCC1(C)CC(CCN)(CCO1)c1ccc(OC)cc1