Reaction Details
TargetCarbonic anhydrase 6
LigandBDBM25896
Substrate/CompetitorBDBM10856
Meas. Tech.CA Inhibition Assay
Ki 654±n/a nM
Citation Temperini, CInnocenti, AScozzafava, ASupuran, CT Carbonic anhydrase inhibitors. Interaction of the antitumor sulfamate EMD 486019 with twelve mammalian carbonic anhydrase isoforms: Kinetic and X-ray crystallographic studies. Bioorg Med Chem Lett18:4282-6 (2008) 
 
Carbonic anhydrase 6
Name:Carbonic anhydrase 6
Type:Enzyme
Mol. Mass.:35371.40
Organism:Homo sapiens (Human)
Description:P23280
Residue:308
BDBM25896
BDBM10856
NameBDBM25896
Synonyms:EMD 486019 | [2-(cycloheptylmethyl)-1,1-dioxo--benzothiophen-6-yl] sulfamate
TypeSmall organic molecule
Emp. Form.C16H21NO5S2
Mol. Mass.371.472
SMILESNS(=O)(=O)Oc1ccc2C=C(CC3CCCCCC3)S(=O)(=O)c2c1