Reaction Details
TargetCarbonic anhydrase 5B, mitochondrial
LigandBDBM25900
Substrate/CompetitorBDBM10856
Meas. Tech.CA Inhibition Assay
Ki 9±n/a nM
Citation Temperini, CCecchi, AScozzafava, ASupuran, CT Carbonic anhydrase inhibitors. Interaction of indapamide and related diuretics with 12 mammalian isozymes and X-ray crystallographic studies for the indapamide-isozyme II adduct. Bioorg Med Chem Lett18:2567-73 (2008) 
 
Carbonic anhydrase 5B, mitochondrial
Name:Carbonic anhydrase 5B, mitochondrial
Type:Enzyme
Mol. Mass.:36440.83
Organism:Homo sapiens (Human)
Description:Human (cloned) isozyme
Residue:317
BDBM25900
BDBM10856
NameBDBM25900
Synonyms:2-chloro-5-(1-hydroxy-3-oxo-2,3-dihydro-1H-isoindol-1-yl)benzene-1-sulfonamide Chlorthalidone Hygroton US10172837, Chlorthalidone
TypeSmall organic molecule
Emp. Form.C14H11ClN2O4S
Mol. Mass.338.766
SMILESNS(=O)(=O)c1cc(ccc1Cl)C1(O)NC(=O)c2ccccc12