Reaction Details
TargetCarbonic anhydrase 14
LigandBDBM13076
Substrate/CompetitorBDBM10856
Meas. Tech.CA Inhibition Assay
Ki 4105±n/a nM
Citation Temperini, CCecchi, AScozzafava, ASupuran, CT Carbonic anhydrase inhibitors. Interaction of indapamide and related diuretics with 12 mammalian isozymes and X-ray crystallographic studies for the indapamide-isozyme II adduct. Bioorg Med Chem Lett18:2567-73 (2008) 
 
Carbonic anhydrase 14
Name:Carbonic anhydrase 14
Type:Enzyme
Mol. Mass.:37665.67
Organism:Homo sapiens (Human)
Description:Human (cloned) isozyme.
Residue:337
BDBM13076
BDBM10856
NameBDBM13076
Synonyms:6-chloro-1,1-dioxo-3,4-dihydro-2H-1,2,4-benzothiadiazine-7-sulfonamide Dichlothiazide Hydrochlorothiazide JFD00715 cid_3639
TypeSmall organic molecule
Emp. Form.C7H8ClN3O4S2
Mol. Mass.297.739
SMILESNS(=O)(=O)c1cc2c(NCNS2(=O)=O)cc1Cl