Reaction Details
TargetCarbonic anhydrase 14
LigandBDBM25903
Substrate/CompetitorBDBM10856
Meas. Tech.CA Inhibition Assay
Ki 250±n/a nM
Citation Temperini, CCecchi, AScozzafava, ASupuran, CT Carbonic anhydrase inhibitors. Interaction of indapamide and related diuretics with 12 mammalian isozymes and X-ray crystallographic studies for the indapamide-isozyme II adduct. Bioorg Med Chem Lett18:2567-73 (2008) 
 
Carbonic anhydrase 14
Name:Carbonic anhydrase 14
Type:Enzyme
Mol. Mass.:37665.67
Organism:Homo sapiens (Human)
Description:Human (cloned) isozyme.
Residue:337
BDBM25903
BDBM10856
NameBDBM25903
Synonyms:3-(butylamino)-4-phenoxy-5-sulfamoylbenzoic acid Bumex Fordiuran | cid_2471
TypeSmall organic molecule
Emp. Form.C17H20N2O5S
Mol. Mass.364.416
SMILESCCCCNc1cc(cc(c1Oc1ccccc1)S(N)(=O)=O)C(O)=O