Reaction Details
TargetTyrosine-protein kinase ITK/TSK
LigandBDBM384534
Substrate/Competitorn/a
Meas. Tech.Enzymatic Activity In Vitro Assays
IC50 0.600±n/a nM
Citation Owens, THill, RJ Benzimidazole derivatives as RLK and ITK inhibitors US Patent US9932329 Publication Date 4/3/2018
 
Tyrosine-protein kinase ITK/TSK
Name:Tyrosine-protein kinase ITK/TSK
Type:Protein
Mol. Mass.:71839.20
Organism:Homo sapiens (Human)
Description:Q08881
Residue:620
BDBM384534
NameBDBM384534
Synonyms:N-(1-(((R)-1-(2-cyano-4,4-dimethylpent-2-enoyl)pyrrolidin-2-yl)methyl)-5-((((R)-1-hydroxy-3,3-dimethylbutan-2-yl)amino)methyl)-1H-benzo[d]imidazol-2-yl)-5-(oxazol-5-yl)-thiophene-2-carboxamide formate | US9932329, Cpd # 4
TypeSmall organic molecule
Emp. Form.C35H43N7O4S
Mol. Mass.657.825
SMILESCC(C)(C)C=C(C#N)C(=O)N1CCC[C@@H]1Cn1c(NC(=O)c2ccc(s2)-c2cnco2)nc2cc(CN[C@@H](CO)C(C)(C)C)ccc12