Reaction Details
TargetTyrosine-protein kinase TXK
LigandBDBM384536
Substrate/Competitorn/a
Meas. Tech.Enzymatic Activity In Vitro Assays
IC50 1.30±n/a nM
Citation Owens, THill, RJ Benzimidazole derivatives as RLK and ITK inhibitors US Patent US9932329 Publication Date 4/3/2018
 
Tyrosine-protein kinase TXK
Name:Tyrosine-protein kinase TXK
Type:Protein
Mol. Mass.:61268.80
Organism:Homo sapiens (Human)
Description:P42681
Residue:527
BDBM384536
NameBDBM384536
Synonyms:N-(1-(((R)-1-(2-cyano-4,4-dimethylpent-2-enoyl)pyrrolidin-2-yl)methyl)-5-((((R)-1-hydroxypropan-2-yl)amino)methyl)-1H-benzo[d]imidazol-2-yl)-5-(oxazol-5-yl)-thiophene-2-carboxamide formate | US9932329, Cpd # 6
TypeSmall organic molecule
Emp. Form.C32H37N7O4S
Mol. Mass.615.746
SMILESC[C@H](CO)NCc1ccc2n(C[C@H]3CCCN3C(=O)C(=CC(C)(C)C)C#N)c(NC(=O)c3ccc(s3)-c3cnco3)nc2c1