Reaction Details
TargetTyrosine-protein kinase TXK
LigandBDBM384538
Substrate/Competitorn/a
Meas. Tech.Enzymatic Activity In Vitro Assays
IC50 0.300±n/a nM
Citation Owens, THill, RJ Benzimidazole derivatives as RLK and ITK inhibitors US Patent US9932329 Publication Date 4/3/2018
 
Tyrosine-protein kinase TXK
Name:Tyrosine-protein kinase TXK
Type:Protein
Mol. Mass.:61268.80
Organism:Homo sapiens (Human)
Description:P42681
Residue:527
BDBM384538
NameBDBM384538
Synonyms:(R)-N-(1-((1-acryloylpyrrolidin-2-yl)methyl)-5-(((cyclopropylmethyl)amino)methyl)-1H-benzo[d]imidazol-2-yl)-5-(oxazol-5-yl)thiophene-2-carboxamide | US9932329, Cpd # 9
TypeSmall organic molecule
Emp. Form.C28H30N6O3S
Mol. Mass.530.641
SMILESC=CC(=O)N1CCC[C@@H]1Cn1c(NC(=O)c2ccc(s2)-c2cnco2)nc2cc(CNCC3CC3)ccc12