Reaction Details
TargetCarbonic anhydrase 4
LigandBDBM25912
Substrate/CompetitorBDBM10856
Meas. Tech.CA Inhibition Assay
Ki 6140±n/a nM
Citation Güzel, OInnocenti, AScozzafava, ASalman, AParkkila, SHilvo, MSupuran, CT Carbonic anhydrase inhibitors: synthesis and inhibition studies against mammalian isoforms I-XV with a series of 2-(hydrazinocarbonyl)-3-substituted-phenyl-1H-indole-5-sulfonamides. Bioorg Med Chem16:9113-20 (2008) 
 
Carbonic anhydrase 4
Name:Carbonic anhydrase 4
Type:Enzyme
Mol. Mass.:35037.98
Organism:Homo sapiens (Human)
Description:P22748
Residue:312
BDBM25912
BDBM10856
NameBDBM25912
Synonyms:3-(3-chlorophenyl)-2-(hydrazinecarbonyl)-1H-indole-5-sulfonamide indole sulfonamide, 8h
TypeSmall organic molecule
Emp. Form.C15H13ClN4O3S
Mol. Mass.364.807
SMILESNNC(=O)c1[nH]c2ccc(cc2c1-c1cccc(Cl)c1)S(N)(=O)=O