Reaction Details
TargetCarbonic anhydrase 5A, mitochondrial
LigandBDBM25908
Substrate/CompetitorBDBM10856
Meas. Tech.CA Inhibition Assay
Ki 804±n/a nM
Citation Güzel, OInnocenti, AScozzafava, ASalman, AParkkila, SHilvo, MSupuran, CT Carbonic anhydrase inhibitors: synthesis and inhibition studies against mammalian isoforms I-XV with a series of 2-(hydrazinocarbonyl)-3-substituted-phenyl-1H-indole-5-sulfonamides. Bioorg Med Chem16:9113-20 (2008) 
 
Carbonic anhydrase 5A, mitochondrial
Name:Carbonic anhydrase 5A, mitochondrial
Type:Enzyme
Mol. Mass.:34755.54
Organism:Homo sapiens (Human)
Description:Human (cloned) isozyme
Residue:305
BDBM25908
BDBM10856
NameBDBM25908
Synonyms:3-(2-fluorophenyl)-2-(hydrazinecarbonyl)-1H-indole-5-sulfonamide indole sulfonamide, 8d
TypeSmall organic molecule
Emp. Form.C15H13FN4O3S
Mol. Mass.348.352
SMILESNNC(=O)c1[nH]c2ccc(cc2c1-c1ccccc1F)S(N)(=O)=O