Reaction Details
TargetCarbonic anhydrase 5A, mitochondrial
LigandBDBM25917
Substrate/CompetitorBDBM10856
Meas. Tech.CA Inhibition Assay
Ki 791±n/a nM
Citation Güzel, OInnocenti, AScozzafava, ASalman, AParkkila, SHilvo, MSupuran, CT Carbonic anhydrase inhibitors: synthesis and inhibition studies against mammalian isoforms I-XV with a series of 2-(hydrazinocarbonyl)-3-substituted-phenyl-1H-indole-5-sulfonamides. Bioorg Med Chem16:9113-20 (2008) 
 
Carbonic anhydrase 5A, mitochondrial
Name:Carbonic anhydrase 5A, mitochondrial
Type:Enzyme
Mol. Mass.:34755.54
Organism:Homo sapiens (Human)
Description:Human (cloned) isozyme
Residue:305
BDBM25917
BDBM10856
NameBDBM25917
Synonyms:2-(hydrazinecarbonyl)-3-(3-methoxyphenyl)-1H-indole-5-sulfonamide indole sulfonamide, 8m
TypeSmall organic molecule
Emp. Form.C16H16N4O4S
Mol. Mass.360.388
SMILESCOc1cccc(c1)-c1c([nH]c2ccc(cc12)S(N)(=O)=O)C(=O)NN