Reaction Details
TargetCarbonic anhydrase 6
LigandBDBM25905
Substrate/CompetitorBDBM10856
Meas. Tech.CA Inhibition Assay
Ki 7384±n/a nM
Citation Güzel, OInnocenti, AScozzafava, ASalman, AParkkila, SHilvo, MSupuran, CT Carbonic anhydrase inhibitors: synthesis and inhibition studies against mammalian isoforms I-XV with a series of 2-(hydrazinocarbonyl)-3-substituted-phenyl-1H-indole-5-sulfonamides. Bioorg Med Chem16:9113-20 (2008) 
 
Carbonic anhydrase 6
Name:Carbonic anhydrase 6
Type:Enzyme
Mol. Mass.:35371.40
Organism:Homo sapiens (Human)
Description:P23280
Residue:308
BDBM25905
BDBM10856
NameBDBM25905
Synonyms:2-(hydrazinecarbonyl)-3-(2-methylphenyl)-1H-indole-5-sulfonamide indole sulfonamide, 8a
TypeSmall organic molecule
Emp. Form.C16H16N4O3S
Mol. Mass.344.388
SMILESCc1ccccc1-c1c([nH]c2ccc(cc12)S(N)(=O)=O)C(=O)NN