Reaction Details
TargetCarbonic anhydrase 9
LigandBDBM25914
Substrate/CompetitorBDBM10856
Meas. Tech.CA Inhibition Assay
Ki 74±n/a nM
Citation Güzel, OInnocenti, AScozzafava, ASalman, AParkkila, SHilvo, MSupuran, CT Carbonic anhydrase inhibitors: synthesis and inhibition studies against mammalian isoforms I-XV with a series of 2-(hydrazinocarbonyl)-3-substituted-phenyl-1H-indole-5-sulfonamides. Bioorg Med Chem16:9113-20 (2008) 
 
Carbonic anhydrase 9
Name:Carbonic anhydrase 9
Type:Enzyme
Mol. Mass.:49669.03
Organism:Homo sapiens (Human)
Description:Catalytic domain of human cloned isozyme was used in the assay
Residue:459
BDBM25914
BDBM10856
NameBDBM25914
Synonyms:3-(2-bromophenyl)-2-(hydrazinecarbonyl)-1H-indole-5-sulfonamide indole sulfonamide, 8j
TypeSmall organic molecule
Emp. Form.C15H13BrN4O3S
Mol. Mass.409.258
SMILESNNC(=O)c1[nH]c2ccc(cc2c1-c1ccccc1Br)S(N)(=O)=O