Reaction Details
TargetCarbonic anhydrase 14
LigandBDBM25913
Substrate/CompetitorBDBM10856
Meas. Tech.CA Inhibition Assay
Ki 7.4±n/a nM
Citation Güzel, OInnocenti, AScozzafava, ASalman, AParkkila, SHilvo, MSupuran, CT Carbonic anhydrase inhibitors: synthesis and inhibition studies against mammalian isoforms I-XV with a series of 2-(hydrazinocarbonyl)-3-substituted-phenyl-1H-indole-5-sulfonamides. Bioorg Med Chem16:9113-20 (2008) 
 
Carbonic anhydrase 14
Name:Carbonic anhydrase 14
Type:Enzyme
Mol. Mass.:37665.67
Organism:Homo sapiens (Human)
Description:Human (cloned) isozyme.
Residue:337
BDBM25913
BDBM10856
NameBDBM25913
Synonyms:3-(4-chlorophenyl)-2-(hydrazinecarbonyl)-1H-indole-5-sulfonamide indole sulfonamide, 8i
TypeSmall organic molecule
Emp. Form.C15H13ClN4O3S
Mol. Mass.364.807
SMILESNNC(=O)c1[nH]c2ccc(cc2c1-c1ccc(Cl)cc1)S(N)(=O)=O