Reaction Details
TargetCarbonic anhydrase 15 [19-324]
LigandBDBM25918
Substrate/CompetitorBDBM10856
Meas. Tech.CA Inhibition Assay
Ki 48±n/a nM
Citation Güzel, OInnocenti, AScozzafava, ASalman, AParkkila, SHilvo, MSupuran, CT Carbonic anhydrase inhibitors: synthesis and inhibition studies against mammalian isoforms I-XV with a series of 2-(hydrazinocarbonyl)-3-substituted-phenyl-1H-indole-5-sulfonamides. Bioorg Med Chem16:9113-20 (2008) 
 
Carbonic anhydrase 15 [19-324]
Name:Carbonic anhydrase 15 [19-324]
Type:Enzyme
Mol. Mass.:33409.51
Organism:Mus musculus (mouse)
Description:Mouse cloned isozyme.
Residue:306
BDBM25918
BDBM10856
NameBDBM25918
Synonyms:2-(hydrazinecarbonyl)-3-(2,3,4,5,6-pentafluorophenyl)-1H-indole-5-sulfonamide indole sulfonamide, 8n
TypeSmall organic molecule
Emp. Form.C15H9F5N4O3S
Mol. Mass.420.314
SMILESNNC(=O)c1[nH]c2ccc(cc2c1-c1c(F)c(F)c(F)c(F)c1F)S(N)(=O)=O