Reaction Details
TargetcGMP-dependent 3',5'-cyclic phosphodiesterase
LigandBDBM384857
Substrate/Competitorn/a
Meas. Tech.PDE2 Assay B
Ki 0.170±n/a nM
Citation Shen, DWang, DQian, XHarper, BYang, MBo, Y Pyrimidinone amide compounds as PDE2 inhibitors US Patent US10285989 Publication Date 5/14/2019
 
cGMP-dependent 3',5'-cyclic phosphodiesterase
Name:cGMP-dependent 3',5'-cyclic phosphodiesterase
Type:Enzyme Catalytic Domain
Mol. Mass.:105691.58
Organism:Homo sapiens (Human)
Description:O00408
Residue:941
BDBM384857
NameBDBM384857
Synonyms:N-{(1R)-1-[4-(difluoromethyl)-2- fluorophenyl]-2,2-dimethylpropyl}-2- (dimethylamino)-6-oxo-1,6- dihydropyrimidine-4-carboxamide | US10285989, Example 73
TypeSmall organic molecule
Emp. Form.C19H23F3N4O2
Mol. Mass.396.4067
SMILESCN(C)c1nc(cc(=O)[nH]1)C(=O)N[C@@H](c1ccc(cc1F)C(F)F)C(C)(C)C