Reaction Details
TargetPhosphodiesterase
LigandBDBM384860
Substrate/Competitorn/a
Meas. Tech.PDE2 Assay B
Ki 0.110±n/a nM
Citation Shen, DWang, DQian, XHarper, BYang, MBo, Y Pyrimidinone amide compounds as PDE2 inhibitors US Patent US10285989 Publication Date 5/14/2019
 
Phosphodiesterase
Name:Phosphodiesterase
Type:Enzyme Catalytic Domain
Mol. Mass.:105547.91
Organism:Macaca mulatta (Rhesus macaque)
Description:n/a
Residue:941
BDBM384860
NameBDBM384860
Synonyms:N-{(1R)-1-[4-(1,1- difluoroethyl)phenyl]-2,2- dimethylpropyl}-2-(dimethylamino)- 6-oxo-1,6-dihydropyrimidine-4- carboxamide | US10285989, Example 76
TypeSmall organic molecule
Emp. Form.C20H26F2N4O2
Mol. Mass.392.4428
SMILESCN(C)c1nc(cc(=O)[nH]1)C(=O)N[C@@H](c1ccc(cc1)C(C)(F)F)C(C)(C)C