Reaction Details
TargetcGMP-dependent 3',5'-cyclic phosphodiesterase
LigandBDBM384949
Substrate/Competitorn/a
Meas. Tech.PDE2 Assay B
Ki 0.170±n/a nM
Citation Shen, DWang, DQian, XHarper, BYang, MBo, Y Pyrimidinone amide compounds as PDE2 inhibitors US Patent US10285989 Publication Date 5/14/2019
 
cGMP-dependent 3',5'-cyclic phosphodiesterase
Name:cGMP-dependent 3',5'-cyclic phosphodiesterase
Type:Enzyme Catalytic Domain
Mol. Mass.:105691.58
Organism:Homo sapiens (Human)
Description:O00408
Residue:941
BDBM384949
NameBDBM384949
Synonyms:N-{(1R)-2,2-dimethyl-1-[4- (trifluoromethyl)phenyl]propyl}-2- [(3S)-3-fluoropyrrolidin-1-yl]-6- oxo-1,6-dihydropyrimidine-4- carboxamide | US10285989, Example 169
TypeSmall organic molecule
Emp. Form.C21H24F4N4O2
Mol. Mass.440.4345
SMILESCC(C)(C)[C@@H](NC(=O)c1cc(=O)[nH]c(n1)N1CC[C@H](F)C1)c1ccc(cc1)C(F)(F)F