Reaction Details
TargetcGMP-dependent 3',5'-cyclic phosphodiesterase
LigandBDBM384988
Substrate/Competitorn/a
Meas. Tech.PDE2 Assay B
Ki 0.120±n/a nM
Citation Shen, DWang, DQian, XHarper, BYang, MBo, Y Pyrimidinone amide compounds as PDE2 inhibitors US Patent US10285989 Publication Date 5/14/2019
 
cGMP-dependent 3',5'-cyclic phosphodiesterase
Name:cGMP-dependent 3',5'-cyclic phosphodiesterase
Type:Enzyme Catalytic Domain
Mol. Mass.:105691.58
Organism:Homo sapiens (Human)
Description:O00408
Residue:941
BDBM384988
NameBDBM384988
Synonyms:2-(dimethylamino)-N-{(1S)-1-[3- fluoro-4- (trifluoromethoxy)phenyl]-2- hydroxy-2-methylpropyl}-6-oxo- 1,6-dihydropyrimidine-4- carboxamide | US10285989, Example 208
TypeSmall organic molecule
Emp. Form.C18H20F4N4O4
Mol. Mass.432.3694
SMILESCN(C)c1nc(cc(=O)[nH]1)C(=O)N[C@@H](c1ccc(OC(F)(F)F)c(F)c1)C(C)(C)O