Reaction Details
TargetMu-type opioid receptor
LigandBDBM179873
Substrate/Competitorn/a
Meas. Tech.Opioid Receptor Binding Assay
IC50 4.20±0.6 nM
Citation Blumberg, LCDeaver, DREyerman, DJWynn, TA Morphan and morphinan analogues, and methods of use US Patent US10287250 Publication Date 5/14/2019
 
Mu-type opioid receptor
Name:Mu-type opioid receptor
Type:G Protein-Coupled Receptor (GPCR)
Mol. Mass.:44789.51
Organism:Homo sapiens (Human)
Description:P35372
Residue:400
BDBM179873
NameBDBM179873
Synonyms:US10231963, Table B.17 US10736890, Compound TABLE B.17 US11534436, Compound Table B.17 US9656961, Example 00134
TypeSmall organic molecule
Emp. Form.C22H30N2O3
Mol. Mass.370.4852
SMILESNC(=O)c1ccc2C[C@H]3N(CC4CCC4)CC[C@@]4(CCCC[C@@]34O)c2c1O