Reaction Details
TargetMu-type opioid receptor
LigandBDBM50278335
Substrate/Competitorn/a
Meas. Tech.Functional Assay (GTPgammaS Binding)
EC50 2.80±0.3 nM
Citation Blumberg, LCDeaver, DREyerman, DJWynn, TA Morphan and morphinan analogues, and methods of use US Patent US10287250 Publication Date 5/14/2019
 
Mu-type opioid receptor
Name:Mu-type opioid receptor
Type:G Protein-Coupled Receptor (GPCR)
Mol. Mass.:44789.51
Organism:Homo sapiens (Human)
Description:P35372
Residue:400
BDBM50278335
NameBDBM50278335
Synonyms:(1R,9R,10S,13S)-17-(cyclobutylmethyl)-3,10,13-trihydroxy-17-azatetracyclo[7.5.3.0^{1,10}.0^{2,7}]heptadeca-2(7),3,5-triene-4-carboxamide US10231963, Table B.19 US10736890, Compound TABLE B.19 US11534436, Compound Table B.19 US9656961, Example 00136
TypeSmall organic molecule
Emp. Form.C22H30N2O4
Mol. Mass.386.4846
SMILESNC(=O)c1ccc2C[C@H]3N(CC4CCC4)CC[C@@]4(C[C@@H](O)CC[C@@]34O)c2c1O