Reaction Details
TargetMu-type opioid receptor
LigandBDBM179883
Substrate/Competitorn/a
Meas. Tech.Functional Assay (GTPgammaS Binding)
EC50 3.50±n/a nM
Citation Blumberg, LCDeaver, DREyerman, DJWynn, TA Morphan and morphinan analogues, and methods of use US Patent US10287250 Publication Date 5/14/2019
 
Mu-type opioid receptor
Name:Mu-type opioid receptor
Type:G Protein-Coupled Receptor (GPCR)
Mol. Mass.:44789.51
Organism:Homo sapiens (Human)
Description:P35372
Residue:400
BDBM179883
NameBDBM179883
Synonyms:US10287250, Example 00074 US9133125, Table C, Compound 1 | US9656961, Example 00145
TypeSmall organic molecule
Emp. Form.C19H27NO
Mol. Mass.285.4238
SMILESC[C@H](C1CC1)N1CC[C@@]2(C)C(C)[C@H]1Cc1ccc(O)cc21