Reaction Details
TargetMitogen-activated protein kinase 10
LigandBDBM25981
Substrate/CompetitorBDBM25978
Meas. Tech.Fluorescence Polarization Assay
pH7.5±n/a
Temperature295.15±n/a K
Ki>4000±n/a nM
IC50>16000±n/a nM
Citation Angell, RMBamborough, PCleasby, ACockerill, SGJones, KLMooney, CJSomers, DOWalker, AL Biphenyl amide p38 kinase inhibitors 1: Discovery and binding mode. Bioorg Med Chem Lett18:318-23 (2008) 
 
Mitogen-activated protein kinase 10
Name:Mitogen-activated protein kinase 10
Type:Enzyme
Mol. Mass.:52586.89
Organism:Homo sapiens (Human)
Description:n/a
Residue:464
BDBM25981
BDBM25978
NameBDBM25981
Synonyms:BMCL18324 Compound 17 D3RKN_78 biphenyl amide, 4
TypeSmall organic molecule
Emp. Form.C21H21N3O2
Mol. Mass.347.4103
SMILESCc1nnc(o1)-c1ccc(C)c(c1)-c1ccc(cc1)C(=O)NCC1CC1