Reaction Details
TargetDipeptidyl peptidase 1
LigandBDBM385065
Substrate/Competitorn/a
Meas. Tech.Fluorescence Assay A1 for Recombinant Human (RH) DPP1
IC50 10.7±n/a nM
Citation Lonn, HRConnolly, SSwallow, SKarlsson, SPAurell, CPontén, JFDoyle, KJVan De Poël, AJJones, GPWatson, DWMacritchie, JAPalmer, NJ Certain (2S)-N-[(1S)-1-cyano-2-phenylethyl]-1,4-oxazepane-2-carboxamides as dipeptidyl peptidase 1 inhibitors US Patent US10287258 Publication Date 5/14/2019
 
Dipeptidyl peptidase 1
Name:Dipeptidyl peptidase 1
Type:Enzyme
Mol. Mass.:51857.28
Organism:Homo sapiens (Human)
Description:P53634
Residue:463
BDBM385065
NameBDBM385065
Synonyms:(2S)-N-[(1S)-1-Cyano-2-{4-[2-oxo-3-(tetrahydro-2H-pyran-4-ylmethyl)-2,3-dihydro- 1,3-benzoxazol-5-yl]phenyl}ethyl]-1,4-oxazepane-2-carboxamide US10669245, Example 25 US11655221, Example 25 US11680049, Example 25 | US20230278969, Example 25
TypeSmall organic molecule
Emp. Form.C28H32N4O5
Mol. Mass.504.5775
SMILESO=C(N[C@@H](Cc1ccc(cc1)-c1ccc2oc(=O)n(CC3CCOCC3)c2c1)C#N)[C@@H]1CNCCCO1