Reaction Details
TargetDipeptidyl peptidase 1
LigandBDBM385066
Substrate/Competitorn/a
Meas. Tech.Fluorescence Assay A1 for Recombinant Human (RH) DPP1
IC50 13.5±n/a nM
Citation Lonn, HRConnolly, SSwallow, SKarlsson, SPAurell, CPontén, JFDoyle, KJVan De Poël, AJJones, GPWatson, DWMacritchie, JAPalmer, NJ Certain (2S)-N-[(1S)-1-cyano-2-phenylethyl]-1,4-oxazepane-2-carboxamides as dipeptidyl peptidase 1 inhibitors US Patent US10287258 Publication Date 5/14/2019
 
Dipeptidyl peptidase 1
Name:Dipeptidyl peptidase 1
Type:Enzyme
Mol. Mass.:51857.28
Organism:Homo sapiens (Human)
Description:P53634
Residue:463
BDBM385066
NameBDBM385066
Synonyms:(2S)-N-{(1S)-2-[4-(7-Chloro-3-methyl-2-oxo-2,3-dihydro-1,3-benzoxazol-5-yl)phenyl]- 1-cyanoethyl}-1,4-oxazepane-2-carboxamide US10669245, Example 26 US11655221, Example 26 US11680049, Example 26 | US20230278969, Example 26
TypeSmall organic molecule
Emp. Form.C23H23ClN4O4
Mol. Mass.454.906
SMILESCn1c2cc(cc(Cl)c2oc1=O)-c1ccc(C[C@H](NC(=O)[C@@H]2CNCCCO2)C#N)cc1