Reaction Details
TargetSerine/threonine-protein kinase B-raf
LigandBDBM26055
Substrate/CompetitorBDBM26040
Meas. Tech.Fluorescence Anisoptrophy Kinase Binding Assay
pH7.5±n/a
Temperature295.15±n/a K
Kd 0.5±n/a nM
Citation Takle, AKBamford, MJDavies, SDavis, RPDean, DKGaiba, AIrving, EAKing, FDNaylor, AParr, CARay, AMReith, ADSmith, BBStaton, PCSteadman, JGStean, TOWilson, DM The identification of potent, selective and CNS penetrant furan-based inhibitors of B-Raf kinase. Bioorg Med Chem Lett18:4373-6 (2008) 
 
Serine/threonine-protein kinase B-raf
Name:Serine/threonine-protein kinase B-raf
Type:Serine/threonine-protein kinase
Mol. Mass.:84446.00
Organism:Homo sapiens (Human)
Description:P15056
Residue:766
BDBM26055
BDBM26040
NameBDBM26055
Synonyms:N-[2-(dimethylamino)ethyl]-4-[(1E)-1-(hydroxyimino)-2,3-dihydro-1H-inden-5-yl]-5-(pyridin-4-yl)furan-2-carboxamide | furan-based compound, 16
TypeSmall organic molecule
Emp. Form.C23H24N4O3
Mol. Mass.404.4617
SMILESCN(C)CCNC(=O)c1cc(c(o1)-c1ccncc1)-c1ccc2C(CCc2c1)N=O