Reaction Details
TargetEpidermal growth factor receptor
LigandBDBM26105
Substrate/CompetitorBDBM10852
Meas. Tech.Fluorescence Binding Assay
pH7.4±n/a
Temperature295.15±n/a K
Kd 10.9±3.3 nM
Citation Yun, CHBoggon, TJLi, YWoo, MSGreulich, HMeyerson, MEck, MJ Structures of lung cancer-derived EGFR mutants and inhibitor complexes: mechanism of activation and insights into differential inhibitor sensitivity. Cancer Cell11:217-27 (2007) 
 
Epidermal growth factor receptor
Name:Epidermal growth factor receptor
Type:Receptor Kinase Domain
Mol. Mass.:134279.59
Organism:Homo sapiens (Human)
Description:P00533
Residue:1210
BDBM26105
BDBM10852
NameBDBM26105
Synonyms:6-{4-[(4-ethylpiperazin-1-yl)methyl]phenyl}-N-[(1R)-1-phenylethyl]-7H-pyrrolo[2,3-d]pyrimidin-4-amine | AEE788
TypeSmall organic molecule
Emp. Form.C27H32N6
Mol. Mass.440.5832
SMILESCCN1CCN(Cc2ccc(cc2)-c2cc3c(N[C@H](C)c4ccccc4)ncnc3[nH]2)CC1