Reaction Details
TargetMetallo-beta-lactamase type 2
LigandBDBM262223
Substrate/Competitorn/a
Meas. Tech.Class B Enzyme Assay
pH7±n/a
IC50 0.637±n/a nM
Commentsextracted
Citation Mandal, MTang, HXiao, LSu, JLi, GYang, SPan, WTang, HDeJesus, RHicks, JLombardo, MChu, HHagmann, WPasternak, AGu, XJiang, JDong, SDing, FLondon, CBiswas, DYoung, KHunter, DNZhao, ZYang, D Metallo-beta-lactamase inhibitors US Patent US9708336 Publication Date 7/18/2017
 
Metallo-beta-lactamase type 2
Name:Metallo-beta-lactamase type 2
Type:PROTEIN
Mol. Mass.:28498.15
Organism:Klebsiella pneumoniae
Description:ChEMBL_103887
Residue:270
BDBM262223
NameBDBM262223
Synonyms:4'-(1H-tetrazol-5-yl)-2-(2H- tetrazol-5-yl)biphenyl-3- sulfonamide | US9708336, 72
TypeSmall organic molecule
Emp. Form.C14H11N9O2S
Mol. Mass.369.361
SMILESNS(=O)(=O)c1cccc(-c2ccc(cc2)-c2nnn[nH]2)c1-c1nn[nH]n1