Reaction Details
TargetMetallo-beta-lactamase type 2
LigandBDBM262287
Substrate/Competitorn/a
Meas. Tech.Class B Enzyme Assay
pH7±n/a
IC50 0.637±n/a nM
Commentsextracted
Citation Mandal, MTang, HXiao, LSu, JLi, GYang, SPan, WTang, HDeJesus, RHicks, JLombardo, MChu, HHagmann, WPasternak, AGu, XJiang, JDong, SDing, FLondon, CBiswas, DYoung, KHunter, DNZhao, ZYang, D Metallo-beta-lactamase inhibitors US Patent US9708336 Publication Date 7/18/2017
 
Metallo-beta-lactamase type 2
Name:Metallo-beta-lactamase type 2
Type:PROTEIN
Mol. Mass.:28498.15
Organism:Klebsiella pneumoniae
Description:ChEMBL_103887
Residue:270
BDBM262287
NameBDBM262287
Synonyms:3-(8-methylimidazo[1,2-a] pyridin-3-yl)-2-(1H- tetrazol-5- yl)benzenesulfonamide | US9708336, 139
TypeSmall organic molecule
Emp. Form.C15H13N7O2S
Mol. Mass.355.374
SMILESCc1cccn2c(cnc12)-c1cccc(c1-c1nnn[nH]1)S(N)(=O)=O