Reaction Details
TargetMetallo-beta-lactamase type 2
LigandBDBM262563
Substrate/Competitorn/a
Meas. Tech.Class B Enzyme Assay
pH7±n/a
IC50 0.580±n/a nM
Commentsextracted
Citation Mandal, MTang, HXiao, LSu, JLi, GYang, SPan, WTang, HDeJesus, RHicks, JLombardo, MChu, HHagmann, WPasternak, AGu, XJiang, JDong, SDing, FLondon, CBiswas, DYoung, KHunter, DNZhao, ZYang, D Metallo-beta-lactamase inhibitors US Patent US9708336 Publication Date 7/18/2017
 
Metallo-beta-lactamase type 2
Name:Metallo-beta-lactamase type 2
Type:PROTEIN
Mol. Mass.:28498.15
Organism:Klebsiella pneumoniae
Description:ChEMBL_103887
Residue:270
BDBM262563
NameBDBM262563
Synonyms:3-(8-amino-5-isoquinolyl)-2-(1H- tetrazol-5-yl)benzenesulfonamide | US9708336, 415
TypeSmall organic molecule
Emp. Form.C16H13N7O2S
Mol. Mass.367.385
SMILESNc1ccc(-c2cccc(c2-c2nnn[nH]2)S(N)(=O)=O)c2ccncc12