Reaction Details
TargetMetallo-beta-lactamase type 2
LigandBDBM262672
Substrate/Competitorn/a
Meas. Tech.Class B Enzyme Assay
pH7±n/a
IC50 0.541±n/a nM
Commentsextracted
Citation Mandal, MTang, HXiao, LSu, JLi, GYang, SPan, WTang, HDeJesus, RHicks, JLombardo, MChu, HHagmann, WPasternak, AGu, XJiang, JDong, SDing, FLondon, CBiswas, DYoung, KHunter, DNZhao, ZYang, D Metallo-beta-lactamase inhibitors US Patent US9708336 Publication Date 7/18/2017
 
Metallo-beta-lactamase type 2
Name:Metallo-beta-lactamase type 2
Type:PROTEIN
Mol. Mass.:28498.15
Organism:Klebsiella pneumoniae
Description:ChEMBL_103887
Residue:270
BDBM262672
NameBDBM262672
Synonyms:3-(1-Oxoisoindolin-4-yl)-2-(2H- tetrazol-5-yl)-6- (trifluoromethyl)benzenesulfonamide | US9708336, 525
TypeSmall organic molecule
Emp. Form.C16H11F3N6O3S
Mol. Mass.424.357
SMILESNS(=O)(=O)c1c(ccc(-c2cccc3C(=O)NCc23)c1-c1nn[nH]n1)C(F)(F)F