Reaction Details
TargetMetallo-beta-lactamase type 2
LigandBDBM262696
Substrate/Competitorn/a
Meas. Tech.Class B Enzyme Assay
pH7±n/a
IC50 0.256±n/a nM
Commentsextracted
Citation Mandal, MTang, HXiao, LSu, JLi, GYang, SPan, WTang, HDeJesus, RHicks, JLombardo, MChu, HHagmann, WPasternak, AGu, XJiang, JDong, SDing, FLondon, CBiswas, DYoung, KHunter, DNZhao, ZYang, D Metallo-beta-lactamase inhibitors US Patent US9708336 Publication Date 7/18/2017
 
Metallo-beta-lactamase type 2
Name:Metallo-beta-lactamase type 2
Type:PROTEIN
Mol. Mass.:28498.15
Organism:Klebsiella pneumoniae
Description:ChEMBL_103887
Residue:270
BDBM262696
NameBDBM262696
Synonyms:3-(2-amino-1,3-benzothiazol- 6-yl)-2-(1H-tetrazol-5-yl)-6- (trifluoromethyl)benzenesulfon- amide | US9708336, 549
TypeSmall organic molecule
Emp. Form.C15H10F3N7O2S2
Mol. Mass.441.411
SMILESNc1nc2ccc(cc2s1)-c1ccc(c(c1-c1nnn[nH]1)S(N)(=O)=O)C(F)(F)F