Reaction Details
TargetMetallo-beta-lactamase type 2
LigandBDBM262698
Substrate/Competitorn/a
Meas. Tech.Class B Enzyme Assay
pH7±n/a
IC50 0.142±n/a nM
Commentsextracted
Citation Mandal, MTang, HXiao, LSu, JLi, GYang, SPan, WTang, HDeJesus, RHicks, JLombardo, MChu, HHagmann, WPasternak, AGu, XJiang, JDong, SDing, FLondon, CBiswas, DYoung, KHunter, DNZhao, ZYang, D Metallo-beta-lactamase inhibitors US Patent US9708336 Publication Date 7/18/2017
 
Metallo-beta-lactamase type 2
Name:Metallo-beta-lactamase type 2
Type:PROTEIN
Mol. Mass.:28498.15
Organism:Klebsiella pneumoniae
Description:ChEMBL_103887
Residue:270
BDBM262698
NameBDBM262698
Synonyms:3-(2-amino-3H-benzimidazol- 4-yl)-2-(1H-tetrazol-5-yl)-6- (trifluoromethyl)benzenesulfon- amide | US9708336, 551
TypeSmall organic molecule
Emp. Form.C15H11F3N8O2S
Mol. Mass.424.36
SMILESNc1nc2cccc(-c3ccc(c(c3-c3nnn[nH]3)S(N)(=O)=O)C(F)(F)F)c2[nH]1