Reaction Details
TargetMetallo-beta-lactamase type 2
LigandBDBM262705
Substrate/Competitorn/a
Meas. Tech.Class B Enzyme Assay
pH7±n/a
IC50 0.145±n/a nM
Commentsextracted
Citation Mandal, MTang, HXiao, LSu, JLi, GYang, SPan, WTang, HDeJesus, RHicks, JLombardo, MChu, HHagmann, WPasternak, AGu, XJiang, JDong, SDing, FLondon, CBiswas, DYoung, KHunter, DNZhao, ZYang, D Metallo-beta-lactamase inhibitors US Patent US9708336 Publication Date 7/18/2017
 
Metallo-beta-lactamase type 2
Name:Metallo-beta-lactamase type 2
Type:PROTEIN
Mol. Mass.:28498.15
Organism:Klebsiella pneumoniae
Description:ChEMBL_103887
Residue:270
BDBM262705
NameBDBM262705
Synonyms:3-(2-aminoquinazolin-8-yl)-2- (2H-tetrazol-5-yl)-6- (trifluoromethyl)benzenesulfon- amide | US9708336, 558
TypeSmall organic molecule
Emp. Form.C16H11F3N8O2S
Mol. Mass.436.371
SMILESNc1ncc2cccc(-c3ccc(c(c3-c3nn[nH]n3)S(N)(=O)=O)C(F)(F)F)c2n1