Reaction Details
TargetMetallo-beta-lactamase type 2
LigandBDBM262717
Substrate/Competitorn/a
Meas. Tech.Class B Enzyme Assay
pH7±n/a
IC50 0.330±n/a nM
Commentsextracted
Citation Mandal, MTang, HXiao, LSu, JLi, GYang, SPan, WTang, HDeJesus, RHicks, JLombardo, MChu, HHagmann, WPasternak, AGu, XJiang, JDong, SDing, FLondon, CBiswas, DYoung, KHunter, DNZhao, ZYang, D Metallo-beta-lactamase inhibitors US Patent US9708336 Publication Date 7/18/2017
 
Metallo-beta-lactamase type 2
Name:Metallo-beta-lactamase type 2
Type:PROTEIN
Mol. Mass.:28498.15
Organism:Klebsiella pneumoniae
Description:ChEMBL_103887
Residue:270
BDBM262717
NameBDBM262717
Synonyms:3-(2-amino-1H-imidazo[4,5-b]pyridin-7-yl)-2-(1H-tetrazol-5-yl)-6-(trifluoromethyl)benzenesulfonamide | US9708336, 570
TypeSmall organic molecule
Emp. Form.C14H10F3N9O2S
Mol. Mass.425.349
SMILESNc1nc2nccc(-c3ccc(c(c3-c3nnn[nH]3)S(N)(=O)=O)C(F)(F)F)c2[nH]1