Reaction Details
TargetMetallo-beta-lactamase type 2
LigandBDBM262855
Substrate/Competitorn/a
Meas. Tech.Class B Enzyme Assay
pH7±n/a
IC50 0.380±n/a nM
Commentsextracted
Citation Mandal, MTang, HXiao, LSu, JLi, GYang, SPan, WTang, HDeJesus, RHicks, JLombardo, MChu, HHagmann, WPasternak, AGu, XJiang, JDong, SDing, FLondon, CBiswas, DYoung, KHunter, DNZhao, ZYang, D Metallo-beta-lactamase inhibitors US Patent US9708336 Publication Date 7/18/2017
 
Metallo-beta-lactamase type 2
Name:Metallo-beta-lactamase type 2
Type:PROTEIN
Mol. Mass.:28498.15
Organism:Klebsiella pneumoniae
Description:ChEMBL_103887
Residue:270
BDBM262855
NameBDBM262855
Synonyms:3-(1H-pyrrolo[2,3-b]pyridin-5- yl)-2-(1H-tetrazol-5-yl)-6- (trifluoromethyl)benzenesulfon- amide | US9708336, 708
TypeSmall organic molecule
Emp. Form.C15H10F3N7O2S
Mol. Mass.409.346
SMILESNS(=O)(=O)c1c(ccc(-c2cnc3[nH]ccc3c2)c1-c1nnn[nH]1)C(F)(F)F