Reaction Details
TargetMetallo-beta-lactamase type 2
LigandBDBM262887
Substrate/Competitorn/a
Meas. Tech.Class B Enzyme Assay
pH7±n/a
IC50 0.229±n/a nM
Commentsextracted
Citation Mandal, MTang, HXiao, LSu, JLi, GYang, SPan, WTang, HDeJesus, RHicks, JLombardo, MChu, HHagmann, WPasternak, AGu, XJiang, JDong, SDing, FLondon, CBiswas, DYoung, KHunter, DNZhao, ZYang, D Metallo-beta-lactamase inhibitors US Patent US9708336 Publication Date 7/18/2017
 
Metallo-beta-lactamase type 2
Name:Metallo-beta-lactamase type 2
Type:PROTEIN
Mol. Mass.:28498.15
Organism:Klebsiella pneumoniae
Description:ChEMBL_103887
Residue:270
BDBM262887
NameBDBM262887
Synonyms:4'-(4-hydroxypiperidin-1-yl)-2- (1H-tetrazol-5-yl)-4- (trifluoromethyl)biphenyl-3- sulfonamide | US9708336, 740
TypeSmall organic molecule
Emp. Form.C19H19F3N6O3S
Mol. Mass.468.453
SMILESNS(=O)(=O)c1c(ccc(-c2ccc(cc2)N2CCC(O)CC2)c1-c1nnn[nH]1)C(F)(F)F