Reaction Details
TargetCarbonic anhydrase 2
LigandBDBM26192
Substrate/CompetitorBDBM10856
Meas. Tech.CA Inhibition Assay
pH7.4±n/a
Temperature298.15±n/a K
Ki 33900±n/a nM
Citation Innocenti, AVullo, DScozzafava, ASupuran, CT Carbonic anhydrase inhibitors: inhibition of mammalian isoforms I-XIV with a series of substituted phenols including paracetamol and salicylic acid. Bioorg Med Chem16:7424-8 (2008) 
 
Carbonic anhydrase 2
Name:Carbonic anhydrase 2
Type:Enzyme
Mol. Mass.:29250.71
Organism:Homo sapiens (Human)
Description:P00918
Residue:260
BDBM26192
BDBM10856
NameBDBM26192
Synonyms:3,5-difluorophenol | phenol derivative, 6
TypeSmall organic molecule
Emp. Form.C6H4F2O
Mol. Mass.130.0922
SMILESOc1cc(F)cc(F)c1