Reaction Details
TargetCarbonic anhydrase 3
LigandBDBM26190
Substrate/CompetitorBDBM10856
Meas. Tech.CA Inhibition Assay
pH7.4±n/a
Temperature298.15±n/a K
Ki 8200±n/a nM
Citation Innocenti, AVullo, DScozzafava, ASupuran, CT Carbonic anhydrase inhibitors: inhibition of mammalian isoforms I-XIV with a series of substituted phenols including paracetamol and salicylic acid. Bioorg Med Chem16:7424-8 (2008) 
 
Carbonic anhydrase 3
Name:Carbonic anhydrase 3
Type:Enzyme
Mol. Mass.:29562.11
Organism:Homo sapiens (Human)
Description:Human cloned isozyme.
Residue:260
BDBM26190
BDBM10856
NameBDBM26190
Synonyms:1,4-Dihydroxybenzene, XIII CHEMBL537 Hydroquinone, HQ phenol derivative, 4
TypeSmall organic molecule
Emp. Form.C6H6O2
Mol. Mass.110.1106
SMILESOc1ccc(O)cc1