Reaction Details
TargetCarbonic anhydrase 4
LigandBDBM26192
Substrate/CompetitorBDBM10856
Meas. Tech.CA Inhibition Assay
Ki 10700±n/a nM
Citation Innocenti, AVullo, DScozzafava, ASupuran, CT Carbonic anhydrase inhibitors: inhibition of mammalian isoforms I-XIV with a series of substituted phenols including paracetamol and salicylic acid. Bioorg Med Chem16:7424-8 (2008) 
 
Carbonic anhydrase 4
Name:Carbonic anhydrase 4
Type:Enzyme
Mol. Mass.:35037.98
Organism:Homo sapiens (Human)
Description:P22748
Residue:312
BDBM26192
BDBM10856
NameBDBM26192
Synonyms:3,5-difluorophenol | phenol derivative, 6
TypeSmall organic molecule
Emp. Form.C6H4F2O
Mol. Mass.130.0922
SMILESOc1cc(F)cc(F)c1