Reaction Details
TargetCarbonic anhydrase 5A, mitochondrial
LigandBDBM26188
Substrate/CompetitorBDBM10856
Meas. Tech.CA Inhibition Assay
Ki 55100±n/a nM
Citation Innocenti, AVullo, DScozzafava, ASupuran, CT Carbonic anhydrase inhibitors: inhibition of mammalian isoforms I-XIV with a series of substituted phenols including paracetamol and salicylic acid. Bioorg Med Chem16:7424-8 (2008) 
 
Carbonic anhydrase 5A, mitochondrial
Name:Carbonic anhydrase 5A, mitochondrial
Type:Enzyme
Mol. Mass.:34755.54
Organism:Homo sapiens (Human)
Description:Human (cloned) isozyme
Residue:305
BDBM26188
BDBM10856
NameBDBM26188
Synonyms:α-CA inhibitor, 12 1,2-dihydroxybenzene benzene-1,2-diol | phenol derivative, 2
TypeSmall organic molecule
Emp. Form.C6H6O2
Mol. Mass.110.1106
SMILESOc1ccccc1O