Reaction Details
TargetCarbonic anhydrase 5A, mitochondrial
LigandBDBM26192
Substrate/CompetitorBDBM10856
Meas. Tech.CA Inhibition Assay
Ki 65000±n/a nM
Citation Innocenti, AVullo, DScozzafava, ASupuran, CT Carbonic anhydrase inhibitors: inhibition of mammalian isoforms I-XIV with a series of substituted phenols including paracetamol and salicylic acid. Bioorg Med Chem16:7424-8 (2008) 
 
Carbonic anhydrase 5A, mitochondrial
Name:Carbonic anhydrase 5A, mitochondrial
Type:Enzyme
Mol. Mass.:34755.54
Organism:Homo sapiens (Human)
Description:Human (cloned) isozyme
Residue:305
BDBM26192
BDBM10856
NameBDBM26192
Synonyms:3,5-difluorophenol | phenol derivative, 6
TypeSmall organic molecule
Emp. Form.C6H4F2O
Mol. Mass.130.0922
SMILESOc1cc(F)cc(F)c1