Reaction Details
TargetCarbonic anhydrase 6
LigandBDBM26193
Substrate/CompetitorBDBM10856
Meas. Tech.CA Inhibition Assay
Ki 11900±n/a nM
Citation Innocenti, AVullo, DScozzafava, ASupuran, CT Carbonic anhydrase inhibitors: inhibition of mammalian isoforms I-XIV with a series of substituted phenols including paracetamol and salicylic acid. Bioorg Med Chem16:7424-8 (2008) 
 
Carbonic anhydrase 6
Name:Carbonic anhydrase 6
Type:Enzyme
Mol. Mass.:35371.40
Organism:Homo sapiens (Human)
Description:P23280
Residue:308
BDBM26193
BDBM10856
NameBDBM26193
Synonyms:2-Hydroxybenzoate, I CHEMBL424 salicylic acid
TypeSmall organic molecule
Emp. Form.C7H6O3
Mol. Mass.138.1207
SMILESOC(=O)c1ccccc1O