Reaction Details
TargetCarbonic anhydrase 12
LigandBDBM26194
Substrate/CompetitorBDBM10856
Meas. Tech.CA Inhibition Assay
Ki 4800±n/a nM
Citation Innocenti, AVullo, DScozzafava, ASupuran, CT Carbonic anhydrase inhibitors: inhibition of mammalian isoforms I-XIV with a series of substituted phenols including paracetamol and salicylic acid. Bioorg Med Chem16:7424-8 (2008) 
 
Carbonic anhydrase 12
Name:Carbonic anhydrase 12
Type:Enzyme
Mol. Mass.:39456.00
Organism:Homo sapiens (Human)
Description:Catalytic domain of human cloned isozyme was used in the assay
Residue:354
BDBM26194
BDBM10856
NameBDBM26194
Synonyms:4-Hydroxybenzoate, III CHEMBL441343 phenol derivative, 8
TypeSmall organic molecule
Emp. Form.C7H6O3
Mol. Mass.138.1207
SMILESOC(=O)c1ccc(O)cc1