Reaction Details
TargetHistamine H3 receptor
LigandBDBM22566
Substrate/CompetitorBDBM22530
Meas. Tech.Radioligand Binding Assay
pH7.4±n/a
Temperature298.15±n/a K
Ki 2239±259 nM
Citation Liu, HAltenbach, RJCarr, TLChandran, PHsieh, GCLewis, LGManelli, AMMilicic, IMarsh, KCMiller, TRStrakhova, MIVortherms, TAWakefield, BDWetter, JMWitte, DGHonore, PEsbenshade, TABrioni, JDCowart, MD cis-4-(Piperazin-1-yl)-5,6,7a,8,9,10,11,11a-octahydrobenzofuro[2,3-h]quinazolin-2-amine (A-987306), A New Histamine H4R Antagonist that Blocks Pain Responses against Carrageenan-Induced Hyperalgesia. J Med Chem51:7094-8 (2008) 
 
Histamine H3 receptor
Name:Histamine H3 receptor
Type:G Protein-Coupled Receptor (GPCR)
Mol. Mass.:48691.47
Organism:Homo sapiens (Human)
Description:Binding assays were using CHO cells stably expressing hH3R receptors.
Residue:445
BDBM22566
BDBM22530
NameBDBM22566
Synonyms:5-chloro-2-[(4-methylpiperazin-1-yl)carbonyl]-1H-indole JNJ 7777120
TypeSmall organic molecule
Emp. Form.C14H16ClN3O
Mol. Mass.277.749
SMILESCN1CCN(CC1)C(=O)c1cc2cc(Cl)ccc2[nH]1