Reaction Details
TargetHistamine H3 receptor
LigandBDBM22566
Substrate/CompetitorBDBM22530
Meas. Tech.Radioligand Binding Assay
pH7.4±n/a
Temperature298.15±n/a K
Ki 1318±260 nM
Citation Altenbach, RJAdair, RMBettencourt, BMBlack, LAFix-Stenzel, SRGopalakrishnan, SMHsieh, GCLiu, HMarsh, KCMcPherson, MJMilicic, IMiller, TRVortherms, TAWarrior, UWetter, JMWishart, NWitte, DGHonore, PEsbenshade, TAHancock, AABrioni, JDCowart, MD Structure-activity studies on a series of a 2-aminopyrimidine-containing histamine H4 receptor ligands. J Med Chem51:6571-80 (2008) 
 
Histamine H3 receptor
Name:Histamine H3 receptor
Type:G Protein-Coupled Receptor (GPCR)
Mol. Mass.:48607.98
Organism:Rattus norvegicus (rat)
Description:n/a
Residue:445
BDBM22566
BDBM22530
NameBDBM22566
Synonyms:5-chloro-2-[(4-methylpiperazin-1-yl)carbonyl]-1H-indole JNJ 7777120
TypeSmall organic molecule
Emp. Form.C14H16ClN3O
Mol. Mass.277.749
SMILESCN1CCN(CC1)C(=O)c1cc2cc(Cl)ccc2[nH]1