Reaction Details
TargetAdenosine receptor A2a
LigandBDBM26254
Substrate/CompetitorBDBM21190
Meas. Tech.Receptor Binding Assay
pH7.4±n/a
Temperature295.15±n/a K
Ki 0.72±0.13 nM
Citation Zhang, XTellew, JELuo, ZMoorjani, MLin, ELanier, MCChen, YWilliams, JPSaunders, JLechner, SMMarkison, SJoswig, TPetroski, RPiercey, JKargo, WMalany, SSantos, MGross, RSWen, JJalali, KO'Brien, ZStotz, CECrespo, MIDiaz, JLSlee, DH Lead Optimization of 4-Acetylamino-2-(3,5-dimethylpyrazol-1-yl)-6-pyridylpyrimidines as A2A Adenosine Receptor Antagonists for the Treatment of Parkinson's Disease. J Med Chem51:7099-7110 (2008) 
 
Adenosine receptor A2a
Name:Adenosine receptor A2a
Type:G Protein-Coupled Receptor (GPCR)
Mol. Mass.:44716.46
Organism:Homo sapiens (Human)
Description:P29274
Residue:412
BDBM26254
BDBM21190
NameBDBM26254
Synonyms:N-[2-(3,5-dimethyl-1H-pyrazol-1-yl)-6-{6-[(2-methoxyethyl)(methyl)amino]pyridin-2-yl}pyrimidin-4-yl]acetamide | pyrazolylpyrimidine derivative, 16h
TypeSmall organic molecule
Emp. Form.C20H25N7O2
Mol. Mass.395.4582
SMILESCOCCN(C)c1cccc(n1)-c1cc(NC(C)=O)nc(n1)-n1nc(C)cc1C