Reaction Details
TargetAndrogen receptor
LigandBDBM26259
Substrate/CompetitorBDBM26258
Meas. Tech.Competitive Radioligand Displacement Assay
pH7.4±n/a
Temperature277.15±n/a K
Ki 2.5±0.2 nM
Citation Bohl, CEWu, ZChen, JMohler, MLYang, JHwang, DJMustafa, SMiller, DDBell, CEDalton, JT Effect of B-ring substitution pattern on binding mode of propionamide selective androgen receptor modulators. Bioorg Med Chem Lett18:5567-70 (2008) 
 
Androgen receptor
Name:Androgen receptor
Type:Enzyme
Mol. Mass.:98219.08
Organism:Rattus norvegicus (Rat)
Description:P15207
Residue:902
BDBM26259
BDBM26258
NameBDBM26259
Synonyms:(2S)-N-[4-cyano-3-(trifluoromethyl)phenyl]-2-hydroxy-2-methyl-3-(4-nitrophenoxy)propanamide | S-21
TypeSmall organic molecule
Emp. Form.C18H14F3N3O5
Mol. Mass.409.3161
SMILESC[C@](O)(COc1ccc(cc1)[N+]([O-])=O)C(=O)Nc1ccc(C#N)c(c1)C(F)(F)F