Reaction Details
TargetAndrogen receptor
LigandBDBM26261
Substrate/CompetitorBDBM26258
Meas. Tech.Competitive Radioligand Displacement Assay
pH7.4±n/a
Temperature277.15±n/a K
Ki 1.7±0.2 nM
Citation Bohl, CEWu, ZChen, JMohler, MLYang, JHwang, DJMustafa, SMiller, DDBell, CEDalton, JT Effect of B-ring substitution pattern on binding mode of propionamide selective androgen receptor modulators. Bioorg Med Chem Lett18:5567-70 (2008) 
 
Androgen receptor
Name:Androgen receptor
Type:Enzyme
Mol. Mass.:98219.08
Organism:Rattus norvegicus (Rat)
Description:P15207
Residue:902
BDBM26261
BDBM26258
NameBDBM26261
Synonyms:(2S)-3-(4-chloro-3-fluorophenoxy)-N-[4-cyano-3-(trifluoromethyl)phenyl]-2-hydroxy-2-methylpropanamide CHEMBL512283 | US9278914, S-II
TypeSmall organic molecule
Emp. Form.C18H13ClF4N2O3
Mol. Mass.416.754
SMILESC[C@](O)(COc1ccc(Cl)c(F)c1)C(=O)Nc1ccc(C#N)c(c1)C(F)(F)F