Reaction Details
TargetGamma-aminobutyric acid receptor subunit alpha-4 [36-554]/beta-2 [26-512]/gamma-2 [40-467]
LigandBDBM26267
Substrate/CompetitorBDBM26267
Meas. Tech.Radioligand Binding Assay
pH7.4±n/a
Temperature295.15±n/a K
Ki 3.1±0.1 nM
Citation Hanson, SMMorlock, EVSatyshur, KACzajkowski, C Structural Requirements for Eszopiclone and Zolpidem Binding to the gamma-Aminobutyric Acid Type-A (GABAA) Receptor Are Different. J Med Chem51:7243-52 (2008) 
 
Gamma-aminobutyric acid receptor subunit alpha-4 [36-554]/beta-2 [26-512]/gamma-2 [40-467]
Name:Gamma-aminobutyric acid receptor subunit alpha-4 [36-554]/beta-2 [26-512]/gamma-2 [40-467]
Synonyms:GABAA Receptor, alpha-4, beta-2, gamma-2
Type:Protein Complex
Mol. Mass.:n/a
Description:n/a
Components:This complex has 3 components.
Component 1
Name:Gamma-aminobutyric acid receptor subunit gamma-2 [40-467]
Type:Ionic channel
Mol. Mass.:49862.76
Organism:Homo sapiens (Human)
Description:P18507[40-467]
Residue:428
Component 2
Name:Gamma-aminobutyric acid receptor subunit beta-2 [26-512]
Synonyms:GABA(A) receptor subunit beta-2 GABRB2 Gamma-aminobutyric acid receptor subunit beta-2
Type:Ionic channel
Mol. Mass.:56212.32
Organism:Homo sapiens (Human)
Description:P47870[26-512]
Residue:487
Component 3
Name:Gamma-aminobutyric acid receptor subunit alpha-4 [36-554]
Synonyms:GABA(A) receptor subunit alpha-4 GABRA4 Gamma-aminobutyric acid receptor subunit alpha-4
Type:Ionic channel
Mol. Mass.:58087.37
Organism:Homo sapiens (Human)
Description:P48169[36-554]
Residue:519
BDBM26267
BDBM26267
NameBDBM26267
Synonyms:RO-154513 [3H]Ro15-4513 | ethyl 12-azido-8-methyl-9-oxo-2,4,8-triazatricyclo[8.4.0.0^{2,6}]tetradeca-1(10),3,5,11,13-pentaene-5-carboxylate
Typeradiolabeled ligand
Emp. Form.C15H14N6O3
Mol. Mass.326.3101
SMILESCCOC(=O)c1ncn-2c1CN(C)C(=O)c1cc(ccc-21)N=[N+]=[N-]